BDBM297346 3-isopropyl-5-(pyrimidin-4-ylamino)isoindolin-1-one (Cpd. No. 13)::US10112955, Example 13
SMILES CC(C)C1NC(=O)c2ccc(Nc3ccncn3)cc12
InChI Key InChIKey=PLZBJLWXNDHFTE-UHFFFAOYSA-N
Data  2 IC50
  Tab Delimited (TSV)   2D SDfile   Computed 3D by Vconf -m prep SDfile
Find this compound or compounds like it in BindingDB:
Activity Spreadsheet -- Enzyme Inhibition Constant Data from BindingDB
Found 1 hit for monomerid = 297346
TargetMAP kinase-interacting serine/threonine-protein kinase 2(Homo sapiens (Human))
Effector Therapeutics
US Patent
LigandPNGBDBM297346(3-isopropyl-5-(pyrimidin-4-ylamino)isoindolin-1-on...)
Affinity DataIC50:  550nM
Ligand InfoPC cidPC sid
In DepthDetails US Patent